#2. Windows resolve undefined identifier.

4 jobs for rsmpbs in 5 minutes and 16 seconds (queued for 1 second)
Status Job ID Name Coverage
  Test
failed #536061
linux
linux_gcc_testing

00:00:32

failed #536060
mac
mac_llvm_testing

00:00:32

failed #536062
nsmwin10
windows_msvc_testing

00:04:42

 
  Analysis
skipped #536063
linux allowed to fail
linux_analysis
 
Name Stage Failure
failed
mac_llvm_testing Test
rsm    =   3.79 sec*proc (3 tests)

Total Test time (real) = 3.80 sec

The following tests FAILED:
2 - rsmcore_tstSessionWorker (Failed)
3 - rsmcore_tstSessionController (Child aborted)
Errors while running CTest
ERROR: Job failed: exit status 1
failed
windows_msvc_testing Test

Total Test time (real) = 0.87 sec

The following tests FAILED:
2 - rsmcore_tstSessionWorker (Failed)
3 - rsmcore_tstSessionController (Failed)
Errors while running CTest
Uploading artifacts for failed job
ERROR: Job failed: exit status 1
failed
linux_gcc_testing Test
Total Test time (real) =   0.24 sec

The following tests FAILED:
2 - rsmcore_tstSessionWorker (Failed)
3 - rsmcore_tstSessionController (Child aborted)
Errors while running CTest
Running after_script
Uploading artifacts for failed job
ERROR: Job failed: exit status 1