Merge branch 'rsmpbs' of code.ornl.gov:jap/rsm into rsmpbs

4 jobs for rsmpbs in 4 minutes and 53 seconds (queued for 2 seconds)
Status Job ID Name Coverage
  Test
failed #535413
linux
linux_gcc_testing

00:00:32

failed #535412
mac
mac_llvm_testing

00:00:27

failed #535414
nsmwin10
windows_msvc_testing

00:04:26

 
  Analysis
skipped #535415
linux allowed to fail
linux_analysis
 
Name Stage Failure
failed
mac_llvm_testing Test
rsm    =   3.61 sec*proc (3 tests)

Total Test time (real) = 3.62 sec

The following tests FAILED:
2 - rsmcore_tstSessionWorker (Failed)
3 - rsmcore_tstSessionController (Child aborted)
Errors while running CTest
ERROR: Job failed: exit status 1
failed
windows_msvc_testing Test
Total Test time (real) =   0.02 sec

The following tests FAILED:
1 - rsmcore_tstHostConfig (Not Run)
2 - rsmcore_tstSessionWorker (Not Run)
3 - rsmcore_tstSessionController (Not Run)
Errors while running CTest
Uploading artifacts for failed job
ERROR: Job failed: exit status 1
failed
linux_gcc_testing Test
Total Test time (real) =   0.24 sec

The following tests FAILED:
2 - rsmcore_tstSessionWorker (Failed)
3 - rsmcore_tstSessionController (Child aborted)
Errors while running CTest
Running after_script
Uploading artifacts for failed job
ERROR: Job failed: exit status 1