#2. Windows compliance #2

4 jobs for rsmpbs in 4 minutes and 55 seconds (queued for 1 second)
Status Job ID Name Coverage
  Test
failed #534131
linux
linux_gcc_testing

00:00:33

failed #534130
mac
mac_llvm_testing

00:00:27

failed #534132
nsmwin10
windows_msvc_testing

00:04:25

 
  Analysis
skipped #534133
linux allowed to fail
linux_analysis
 
Name Stage Failure
failed
mac_llvm_testing Test
rsm    =   4.68 sec*proc (3 tests)

Total Test time (real) = 4.69 sec

The following tests FAILED:
2 - rsmcore_tstSessionWorker (Failed)
3 - rsmcore_tstSessionController (Child aborted)
Errors while running CTest
ERROR: Job failed: exit status 1
failed
windows_msvc_testing Test
Total Test time (real) =   0.02 sec

The following tests FAILED:
1 - rsmcore_tstHostConfig (Not Run)
2 - rsmcore_tstSessionWorker (Not Run)
3 - rsmcore_tstSessionController (Not Run)
Errors while running CTest
Uploading artifacts for failed job
ERROR: Job failed: exit status 1
failed
linux_gcc_testing Test
Total Test time (real) =   0.25 sec

The following tests FAILED:
2 - rsmcore_tstSessionWorker (Failed)
3 - rsmcore_tstSessionController (Child aborted)
Errors while running CTest
Running after_script
Uploading artifacts for failed job
ERROR: Job failed: exit status 1