#2. Windows compliance issues. Still need to resolve POSIX permissions in open...

#2. Windows compliance issues. Still need to resolve POSIX permissions in open file/directory in SFTP.
4 jobs for rsmpbs in 4 minutes and 25 seconds (queued for 1 second)
Status Job ID Name Coverage
  Test
failed #533776
linux
linux_gcc_testing

00:00:32

failed #533775
mac
mac_llvm_testing

00:00:24

failed #533777
nsmwin10
windows_msvc_testing

00:04:24

 
  Analysis
skipped #533778
linux allowed to fail
linux_analysis
 
Name Stage Failure
failed
windows_msvc_testing Test
Total Test time (real) =   0.02 sec

The following tests FAILED:
1 - rsmcore_tstHostConfig (Not Run)
2 - rsmcore_tstSessionWorker (Not Run)
3 - rsmcore_tstSessionController (Not Run)
Errors while running CTest
Uploading artifacts for failed job
ERROR: Job failed: exit status 1
failed
linux_gcc_testing Test
Total Test time (real) =   0.24 sec

The following tests FAILED:
2 - rsmcore_tstSessionWorker (Failed)
3 - rsmcore_tstSessionController (Child aborted)
Errors while running CTest
Running after_script
Uploading artifacts for failed job
ERROR: Job failed: exit status 1
failed
mac_llvm_testing Test
rsm    =   3.32 sec*proc (3 tests)

Total Test time (real) = 3.33 sec

The following tests FAILED:
2 - rsmcore_tstSessionWorker (Failed)
3 - rsmcore_tstSessionController (Child aborted)
Errors while running CTest
ERROR: Job failed: exit status 1