Yaml updates. Add manual fortify job.

9 jobs for radixtcp in 11 minutes and 35 seconds (queued for 1 second)
latest
Name Stage Failure
failed
linux-fortify Analysis
 #include "xercesc/dom/DOM.hpp"
^
compilation terminated.
make[2]: *** [radixtcp/examples/CMakeFiles/tcpserver.dir/tcpserver.cc.o] Error 1
make[1]: *** [radixtcp/examples/CMakeFiles/tcpserver.dir/all] Error 2
make: *** [all] Error 2
Running after_script
Uploading artifacts for failed job
ERROR: Job failed: exit status 1
failed
linux_analysis Analysis
11/42 MemCheck: #11: radixalgorithm_tstMergeSortFortran ...........   Defects: 3
MemCheck log files can be found here: ( * corresponds to test number)
/home/gitlab-runner/builds/3f7f1a15/0/jap/radix/build/Testing/Temporary/MemoryChecker.*.log
Memory checking results:
Potential Memory Leak - 3
Errors while running CTest
Running after_script
Uploading artifacts for failed job
ERROR: Job failed: exit status 1
failed
windows_intel_shared_testing Test
Constructing a list of tests
Updating test list for fixtures
Added 0 tests to meet fixture requirements
Checking test dependency graph...
Checking test dependency graph end
No tests were found!!!
Errors while running CTest
Uploading artifacts for failed job
ERROR: Job failed: exit status 1
failed
windows_msvc_testing Test
Constructing a list of tests
Updating test list for fixtures
Added 0 tests to meet fixture requirements
Checking test dependency graph...
Checking test dependency graph end
No tests were found!!!
Errors while running CTest
Uploading artifacts for failed job
ERROR: Job failed: exit status 1
failed
mac_llvm_testing Test
  TriBITS/tribits/core/package_arch/TribitsGlobalMacros.cmake:1681 (TRIBITS_PROCESS_ENABLED_TPL)
TriBITS/tribits/core/package_arch/TribitsProjectImpl.cmake:202 (TRIBITS_PROCESS_ENABLED_TPLS)
TriBITS/tribits/core/package_arch/TribitsProjectImpl.cmake:341 (TRIBITS_PROJECT_IMPL)
CMakeLists.txt:44 (TRIBITS_PROJECT_ENABLE_ALL)


-- Configuring incomplete, errors occurred!
See also "/Users/jap/builds/df563b7c/1/jap/radix/build/CMakeFiles/CMakeOutput.log".
ERROR: Job failed: exit status 1
failed
windows_mingw_testing Test
Constructing a list of tests
Updating test list for fixtures
Added 0 tests to meet fixture requirements
Checking test dependency graph...
Checking test dependency graph end
No tests were found!!!
Errors while running CTest
Uploading artifacts for failed job
ERROR: Job failed: exit status 1
failed
mac_gcc_testing Test
  TriBITS/tribits/core/package_arch/TribitsGlobalMacros.cmake:1681 (TRIBITS_PROCESS_ENABLED_TPL)
TriBITS/tribits/core/package_arch/TribitsProjectImpl.cmake:202 (TRIBITS_PROCESS_ENABLED_TPLS)
TriBITS/tribits/core/package_arch/TribitsProjectImpl.cmake:341 (TRIBITS_PROJECT_IMPL)
CMakeLists.txt:44 (TRIBITS_PROJECT_ENABLE_ALL)


-- Configuring incomplete, errors occurred!
See also "/Users/jap/builds/df563b7c/0/jap/radix/build/CMakeFiles/CMakeOutput.log".
ERROR: Job failed: exit status 1